BDBM50038750 3-((R)-2-Pyridin-3-yl-thiazolidine-4-carbonyl)-indole-1-carboxylic acid tert-butyl ester::CHEMBL64214
SMILES CC(C)(C)OC(=O)n1cc(C(=O)[C@@H]2CSC(N2)c2cccnc2)c2ccccc12
InChI Key InChIKey=ZYDYAOTXGMFSHO-DIMJTDRSSA-N
Data  1 KI
  Tab Delimited (TSV)   2D SDfile   Computed 3D by Vconf -m prep SDfile
Find this compound or compounds like it in BindingDB:
Activity Spreadsheet -- Enzyme Inhibition Constant Data from BindingDB
Found 1 hit for monomerid = 50038750
TargetPlatelet-activating factor receptor(Cavia porcellus)
Abbott Laboratories
Curated by ChEMBL
LigandPNGBDBM50038750(3-((R)-2-Pyridin-3-yl-thiazolidine-4-carbonyl)-ind...)
Affinity DataKi:  1nM. Assay description: Antagonist activity against platelet activating factor (PAF) receptor in rabbit platelet membranes using [3H]C18-PAF as radioligand
In DepthDetails ArticlePubMed