BDBM50040063 2-(2-Hydroxy-cyclohexyl)-4,6-dipropyl-2,4-dihydro-[1,2,3]triazolo[4,5-d]pyrimidine-5,7-dione::CHEMBL100176
SMILES CCCn1c2nn(nc2c(=O)n(CCC)c1=O)C1CCCCC1O
InChI Key InChIKey=OBZITOASJYYTLW-UHFFFAOYSA-N
Data  1 KI
  Tab Delimited (TSV)   2D SDfile   Computed 3D by Vconf -m prep SDfile
Find this compound or compounds like it in BindingDB:
Activity Spreadsheet -- Enzyme Inhibition Constant Data from BindingDB
Found 1 hit for monomerid = 50040063
TargetAdenosine receptor A1(BOVINE)
Università
Curated by ChEMBL
LigandPNGBDBM50040063(2-(2-Hydroxy-cyclohexyl)-4,6-dipropyl-2,4-dihydro-...)
Affinity DataKi:  1.40E+3nM. Assay description: Affinity to A1 adenosine receptor was measured by the displacement of [3H]-PIA in bovine brain cortical membrane
In DepthDetails ArticlePubMed