BDBM50040918 5,6-Bis-(methyl-phenyl-amino)-isoindole-1,3-dione::CHEMBL267941
SMILES CN(c1ccccc1)c1cc2C(=O)NC(=O)c2cc1N(C)c1ccccc1
InChI Key InChIKey=PNXRSOJTSRJLPV-UHFFFAOYSA-N
Data  4 IC50
  Tab Delimited (TSV)   2D SDfile   Computed 3D by Vconf -m prep SDfile
Find this compound or compounds like it in BindingDB:
Activity Spreadsheet -- Enzyme Inhibition Constant Data from BindingDB
Found 4 hits for monomerid = 50040918
TargetTyrosine-protein kinase ABL1/ABL2(Homo sapiens (Human))
Ciba-Geigy
Curated by ChEMBL
LigandPNGBDBM50040918(5,6-Bis-(methyl-phenyl-amino)-isoindole-1,3-dione ...)
Affinity DataIC50: >5.00E+4nM. Assay description: Inhibitory activity against v-abl tyrosine kinase
In DepthDetails ArticlePubMed
TargetProto-oncogene tyrosine-protein kinase Src(Homo sapiens (Human))
Ciba-Geigy
Curated by ChEMBL
LigandPNGBDBM50040918(5,6-Bis-(methyl-phenyl-amino)-isoindole-1,3-dione ...)
Affinity DataIC50: >1.00E+5nM. Assay description: Inhibitory activity against c-src tyrosine kinase
In DepthDetails ArticlePubMed
TargetEpidermal growth factor receptor(Homo sapiens (Human))
Ciba-Geigy
Curated by ChEMBL
LigandPNGBDBM50040918(5,6-Bis-(methyl-phenyl-amino)-isoindole-1,3-dione ...)
Affinity DataIC50: >5.00E+4nM. Assay description: Inhibitory activity against recombinant tyrosine kinase EGF-R (EGF-R ICD)
In DepthDetails ArticlePubMed
TargetcAMP-dependent protein kinase(Oryctolagus cuniculus (Rabbit))
Ciba-Geigy
Curated by ChEMBL
LigandPNGBDBM50040918(5,6-Bis-(methyl-phenyl-amino)-isoindole-1,3-dione ...)
Affinity DataIC50: >5.00E+5nM. Assay description: Inhibitory activity was determined against protein kinase A (PKA) of rabbit
In DepthDetails ArticlePubMed