BDBM50041028 (R)-4-Isobutylamino-7,7-dioxo-4,5,6,7-tetrahydro-7lambda*6*-thieno[2,3-b]thiopyran-2-sulfonic acid amide::CHEMBL9849
SMILES CC(C)CN[C@@H]1CCS(=O)(=O)c2sc(cc12)S(N)(=O)=O
InChI Key InChIKey=JFLUCCKXAYBETQ-SECBINFHSA-N
Data  2 KI  1 IC50
  Tab Delimited (TSV)   2D SDfile   Computed 3D by Vconf -m prep SDfile
Find this compound or compounds like it in BindingDB:
Activity Spreadsheet -- Enzyme Inhibition Constant Data from BindingDB
Found 3 hits for monomerid = 50041028
TargetCarbonic anhydrase 2(Homo sapiens (Human))
Abbott Laboratories
Curated by ChEMBL
LigandPNGBDBM50041028((R)-4-Isobutylamino-7,7-dioxo-4,5,6,7-tetrahydro-7...)
Affinity DataKi:  71nM. Assay description: Compound was evaluated for the affinity towards Human Carbonic anhydrase II (HCA II)
In DepthDetails ArticlePubMed
TargetCarbonic anhydrase 2(Homo sapiens (Human))
Abbott Laboratories
Curated by ChEMBL
LigandPNGBDBM50041028((R)-4-Isobutylamino-7,7-dioxo-4,5,6,7-tetrahydro-7...)
Affinity DataKi:  71nM. Assay description: 50% inhibitory concentration against human carbonic anhydrase II (HCA II) after pre-incubation for 4 min at 37 degree C
In DepthDetails ArticlePubMed
TargetCarbonic anhydrase 2(Homo sapiens (Human))
Abbott Laboratories
Curated by ChEMBL
LigandPNGBDBM50041028((R)-4-Isobutylamino-7,7-dioxo-4,5,6,7-tetrahydro-7...)
Affinity DataIC50:  45nM. Assay description: Compound was evaluated for the inhibitory activity against Human Carbonic anhydrase II (HCA II)
In DepthDetails ArticlePubMed