BDBM50041061 2-(2-Mercaptomethyl-3-phenyl-butyrylamino)-hexanoic acid::CHEMBL11537
SMILES CCCCC(NC(=O)C(CS)C(C)c1ccccc1)C(O)=O
InChI Key InChIKey=OBBKVNVXJICTJB-UHFFFAOYSA-N
Data  2 IC50
  Tab Delimited (TSV)   2D SDfile   Computed 3D by Vconf -m prep SDfile
Find this compound or compounds like it in BindingDB:
Activity Spreadsheet -- Enzyme Inhibition Constant Data from BindingDB
Found 2 hits for monomerid = 50041061
TargetNeprilysin(Homo sapiens (Human))
University Of Paris
Curated by ChEMBL
LigandPNGBDBM50041061(2-(2-Mercaptomethyl-3-phenyl-butyrylamino)-hexanoi...)
Affinity DataIC50:  3.10nM. Assay description: In vivo inhibitory potency against neutral endopeptidase by displacement of [3H]-HACBOGly binding in mouse kidney
In DepthDetails ArticlePubMed
TargetAngiotensin-converting enzyme(Mus musculus)
University Of Paris
Curated by ChEMBL
LigandPNGBDBM50041061(2-(2-Mercaptomethyl-3-phenyl-butyrylamino)-hexanoi...)
Affinity DataIC50:  7nM. Assay description: Inhibitory potency against angiotensin converting enzyme by displacement of [3H]-trandolaprilate binding in mouse lung
In DepthDetails ArticlePubMed