BDBM50043019 CHEMBL3355029
SMILES O[C@H]1CC[C@@H](CC1)Oc1nc(nc2[nH]ncc12)-c1ccc(NS(=O)(=O)c2cc(Cl)ccc2F)cc1
InChI Key
Data  7 IC50
  Tab Delimited (TSV)   2D SDfile   Computed 3D by Vconf -m prep SDfile
Find this compound or compounds like it in BindingDB:
Activity Spreadsheet -- Enzyme Inhibition Constant Data from BindingDB
Found 7 hits for monomerid = 50043019
TargetSerine/threonine-protein kinase Sgk1(Homo sapiens (Human))
Dart Neuroscience
Curated by ChEMBL
LigandPNGBDBM50043019(CHEMBL3355029)
Affinity DataIC50:  120nM. Assay description: Inhibition of recombinant SGK1 (unknown origin) expressed in U2OS cells by cellular activity assay
In DepthDetails ArticlePubMed
TargetSerine/threonine-protein kinase Sgk1(Homo sapiens (Human))
Dart Neuroscience
Curated by ChEMBL
LigandPNGBDBM50043019(CHEMBL3355029)
Affinity DataIC50: <1.5nM. Assay description: Inhibition of SGK1 (unknown origin) assessed as substrate phosphorylation
In DepthDetails ArticlePubMed
TargetCytochrome P450 3A4(Homo sapiens (Human))
Sanofi R&D
Curated by ChEMBL
LigandPNGBDBM50043019(CHEMBL3355029)
Affinity DataIC50: >3.00E+3nM. Assay description: Inhibition of CYP3A4 in human liver microsomes using testosterone as substrate incubated for 30 mins by LC-MS/MS analysis
In DepthDetails ArticlePubMed
TargetCytochrome P450 3A4(Homo sapiens (Human))
Sanofi R&D
Curated by ChEMBL
LigandPNGBDBM50043019(CHEMBL3355029)
Affinity DataIC50: >3.00E+3nM. Assay description: Inhibition of CYP3A4 in human liver microsomes using midazolam as substrate incubated for 10 mins by LC-MS/MS analysis
In DepthDetails ArticlePubMed
TargetSerine/threonine-protein kinase Sgk1(Homo sapiens (Human))
Dart Neuroscience
Curated by ChEMBL
LigandPNGBDBM50043019(CHEMBL3355029)
Affinity DataIC50:  3nM. Assay description: Inhibition of recombinant human SGK1 expressed in baculovirus expression system using 5-carboxyfluorescein -RPRAATF-NH2 as substrate preincubated for...
In DepthDetails ArticlePubMed
TargetSerine/threonine-protein kinase Sgk1(Mus musculus (Mouse))
Sanofi R&D
Curated by ChEMBL
LigandPNGBDBM50043019(CHEMBL3355029)
Affinity DataIC50:  253nM. Assay description: Inhibition of mouse SGK1 in presence 500 uM presence of ATP
In DepthDetails ArticlePubMed
TargetSerine/threonine-protein kinase Sgk1(Homo sapiens (Human))
Dart Neuroscience
Curated by ChEMBL
LigandPNGBDBM50043019(CHEMBL3355029)
Affinity DataIC50: <1nM. Assay description: Inhibition of recombinant human SGK1 expressed in baculovirus expression system using 5-carboxyfluorescein -RPRAATF-NH2 as substrate preincubated for...
In DepthDetails ArticlePubMed