BDBM50043264 4'-(4-Acetylamino-2-butyl-benzoimidazol-1-ylmethyl)-biphenyl-2-carboxylic acid::CHEMBL334741
SMILES CCCCc1nc2c(NC(C)=O)cccc2n1Cc1ccc(cc1)-c1ccccc1C(O)=O
InChI Key InChIKey=GGORSLNOZHLIQM-UHFFFAOYSA-N
Data  1 IC50
  Tab Delimited (TSV)   2D SDfile   Computed 3D by Vconf -m prep SDfile
Find this compound or compounds like it in BindingDB:
Activity Spreadsheet -- Enzyme Inhibition Constant Data from BindingDB
Found 1 hit for monomerid = 50043264
TargetType-1 angiotensin II receptor B(RAT)
Dr. Karl Thomae
Curated by ChEMBL
LigandPNGBDBM50043264(4'-(4-Acetylamino-2-butyl-benzoimidazol-1-ylmethyl...)
Affinity DataIC50:  5.70E+3nM. Assay description: Inhibition of specific binding of [125I]-angiotensin-II to angiotensin 1 receptor in rat lung membrane preparation
In DepthDetails ArticlePubMed