BDBM50043494 3-{3-[3-(3-Methoxy-phenyl)-ureido]-2-oxo-5-phenyl-2,3-dihydro-benzo[e][1,4]diazepin-1-yl}-propionic acid::CHEMBL132603
SMILES COc1cccc(NC(=O)NC2N=C(c3ccccc3)c3ccccc3N(CCC(O)=O)C2=O)c1
InChI Key InChIKey=GWCNKUPWOROOTO-UHFFFAOYSA-N
Data  2 IC50
  Tab Delimited (TSV)   2D SDfile   Computed 3D by Vconf -m prep SDfile
Find this compound or compounds like it in BindingDB:
Activity Spreadsheet -- Enzyme Inhibition Constant Data from BindingDB
Found 2 hits for monomerid = 50043494
TargetGastrin/cholecystokinin type B receptor(Homo sapiens (Human))
Merck Research Laboratories
Curated by ChEMBL
LigandPNGBDBM50043494(3-{3-[3-(3-Methoxy-phenyl)-ureido]-2-oxo-5-phenyl-...)
Affinity DataIC50:  250nM. Assay description: Inhibition of binding of [125I]-CCK-8 to the cholecystokinin type B receptor
In DepthDetails ArticlePubMed
TargetCholecystokinin receptor type A(RAT)
Merck Research Laboratories
Curated by ChEMBL
LigandPNGBDBM50043494(3-{3-[3-(3-Methoxy-phenyl)-ureido]-2-oxo-5-phenyl-...)
Affinity DataIC50:  9nM. Assay description: Inhibition of binding of [125I]CCK-8 to cholecystokinin type A receptor in rat pancreatic tissue
In DepthDetails ArticlePubMed