BDBM50043513 1-(3-Bromo-phenyl)-3-(1-methyl-2-oxo-5-phenyl-2,3-dihydro-1H-benzo[e][1,4]diazepin-3-yl)-urea::CHEMBL134340
SMILES CN1c2ccccc2C(=NC(NC(=O)Nc2cccc(Br)c2)C1=O)c1ccccc1
InChI Key InChIKey=OEVJVZBGSGPADR-UHFFFAOYSA-N
Data  2 IC50
  Tab Delimited (TSV)   2D SDfile   Computed 3D by Vconf -m prep SDfile
Find this compound or compounds like it in BindingDB:
Activity Spreadsheet -- Enzyme Inhibition Constant Data from BindingDB
Found 2 hits for monomerid = 50043513
TargetCholecystokinin receptor type A(RAT)
Merck Research Laboratories
Curated by ChEMBL
LigandPNGBDBM50043513(1-(3-Bromo-phenyl)-3-(1-methyl-2-oxo-5-phenyl-2,3-...)
Affinity DataIC50:  4.40nM. Assay description: Inhibition of binding of [125I]CCK-8 to cholecystokinin type A receptor in rat pancreatic tissue
In DepthDetails ArticlePubMed
TargetGastrin/cholecystokinin type B receptor(Homo sapiens (Human))
Merck Research Laboratories
Curated by ChEMBL
LigandPNGBDBM50043513(1-(3-Bromo-phenyl)-3-(1-methyl-2-oxo-5-phenyl-2,3-...)
Affinity DataIC50:  5nM. Assay description: Inhibition of binding of [125I]-CCK-8 to the cholecystokinin type B receptor
In DepthDetails ArticlePubMed