BDBM50043547 1-[1-(1H-Imidazol-4-ylmethyl)-2-oxo-5-phenyl-2,3-dihydro-1H-benzo[e][1,4]diazepin-3-yl]-3-m-tolyl-urea::CHEMBL137043
SMILES Cc1cccc(NC(=O)NC2N=C(c3ccccc3)c3ccccc3N(Cc3cnc[nH]3)C2=O)c1
InChI Key InChIKey=SYNRPHGHCPARDX-UHFFFAOYSA-N
Data  2 IC50
  Tab Delimited (TSV)   2D SDfile   Computed 3D by Vconf -m prep SDfile
Find this compound or compounds like it in BindingDB:
Activity Spreadsheet -- Enzyme Inhibition Constant Data from BindingDB
Found 2 hits for monomerid = 50043547
TargetGastrin/cholecystokinin type B receptor(Homo sapiens (Human))
Merck Research Laboratories
Curated by ChEMBL
LigandPNGBDBM50043547(1-[1-(1H-Imidazol-4-ylmethyl)-2-oxo-5-phenyl-2,3-d...)
Affinity DataIC50:  7.90nM. Assay description: Inhibition of binding of [125I]-CCK-8 to the cholecystokinin type B receptor
In DepthDetails ArticlePubMed
TargetCholecystokinin receptor type A(RAT)
Merck Research Laboratories
Curated by ChEMBL
LigandPNGBDBM50043547(1-[1-(1H-Imidazol-4-ylmethyl)-2-oxo-5-phenyl-2,3-d...)
Affinity DataIC50:  11nM. Assay description: Inhibition of binding of [125I]CCK-8 to cholecystokinin type A receptor in rat pancreatic tissue
In DepthDetails ArticlePubMed