BDBM50043871 CHEMBL3356057::US9174993, 4::US9221828, 4
SMILES Fc1cc(ccc1NS(=O)(=O)c1cccc(Cl)c1Cl)-c1cnc2cn[nH]c2n1
InChI Key InChIKey=MBHQIISXEJXGPA-UHFFFAOYSA-N
Data  4 IC50
  Tab Delimited (TSV)   2D SDfile   Computed 3D by Vconf -m prep SDfile
Find this compound or compounds like it in BindingDB:
Activity Spreadsheet -- Enzyme Inhibition Constant Data from BindingDB
Found 4 hits for monomerid = 50043871
TargetSerine/threonine-protein kinase Sgk1(Homo sapiens (Human))
Sanofi
US Patent
LigandPNGBDBM50043871(CHEMBL3356057 | US9174993, 4 | US9221828, 4)
Affinity DataIC50:  419nM. Assay description: The compounds were tested for serum and glucocorticoid-regulated kinase 1 (SGK-1) inhibitory activity in a substrate phosphorylation assay designed t...
In DepthDetails US Patent
TargetSerine/threonine-protein kinase Sgk1(Homo sapiens (Human))
Sanofi
US Patent
LigandPNGBDBM50043871(CHEMBL3356057 | US9174993, 4 | US9221828, 4)
Affinity DataIC50:  419nM. Assay description: Inhibition of human SGK1 using fluo-5(6)-carboxyfluorescein)-RPRAATF-NH2 fluorescently labeled peptide by substrate phosphorylation assay in presence...
In DepthDetails ArticlePubMed
TargetSerine/threonine-protein kinase Sgk1(Homo sapiens (Human))
Sanofi
US Patent
LigandPNGBDBM50043871(CHEMBL3356057 | US9174993, 4 | US9221828, 4)
Affinity DataIC50:  5.73E+3nM. Assay description: Inhibition of human SGK1 using fluo-5(6)-carboxyfluorescein)-RPRAATF-NH2 fluorescently labeled peptide by substrate phosphorylation assay in presence...
In DepthDetails ArticlePubMed
TargetSerine/threonine-protein kinase Sgk1(Homo sapiens (Human))
Sanofi
US Patent
LigandPNGBDBM50043871(CHEMBL3356057 | US9174993, 4 | US9221828, 4)
Affinity DataIC50:  419nMpH: 7.4 T: 2°C. Assay description: The enzyme reaction was carried out in a buffer containing 25 mM Tris-HCl (pH 7.4), 5 mM MgCl2, 2 mM MnCl2, 2 mM DTT, and 0.03% bovine serum albumi...
In DepthDetails US Patent