BDBM50044587 CHEMBL3329425
SMILES COc1ccc(Cl)cc1NS(=O)(=O)c1ccc(OC)c2C[C@H](CCc12)N(C)C
InChI Key InChIKey=DUNOTSIJXJAZFG-AWEZNQCLSA-N
Data  1 KI
  Tab Delimited (TSV)   2D SDfile   Computed 3D by Vconf -m prep SDfile
Find this compound or compounds like it in BindingDB:
Activity Spreadsheet -- Enzyme Inhibition Constant Data from BindingDB
Found 1 hit for monomerid = 50044587
Target5-hydroxytryptamine receptor 6(Homo sapiens (Human))
Universidad Complutense De Madrid
Curated by ChEMBL
LigandPNGBDBM50044587(CHEMBL3329425)
Affinity DataKi:  1.70nM. Assay description: Antagonist activity at human recombinant 5HT6 receptor expressed in CHO cells
In DepthDetails ArticlePubMed