BDBM50044590 CHEMBL191429
SMILES COc1ccc(NS(=O)(=O)c2ccc(I)cc2)cc1N1CCNCC1
InChI Key InChIKey=MWNFFPVWBIUIPM-UHFFFAOYSA-N
Data  1 KI
  Tab Delimited (TSV)   2D SDfile   Computed 3D by Vconf -m prep SDfile
Find this compound or compounds like it in BindingDB:
Activity Spreadsheet -- Enzyme Inhibition Constant Data from BindingDB
Found 1 hit for monomerid = 50044590
Target5-hydroxytryptamine receptor 6(Homo sapiens (Human))
Universidad Complutense De Madrid
Curated by ChEMBL
LigandPNGBDBM50044590(CHEMBL191429)
Affinity DataKi:  2.30nM. Assay description: Antagonist activity at human recombinant 5HT6 receptor expressed in CHO cells
In DepthDetails ArticlePubMed