BDBM50044600 CHEMBL3329446
SMILES CN1CCCC1Cc1c[nH]c2ccc(OC3CCCCC3)cc12
InChI Key InChIKey=AAAHKMSAPZHJEC-UHFFFAOYSA-N
Data  1 KI
  Tab Delimited (TSV)   2D SDfile   Computed 3D by Vconf -m prep SDfile
Find this compound or compounds like it in BindingDB:
Activity Spreadsheet -- Enzyme Inhibition Constant Data from BindingDB
Found 1 hit for monomerid = 50044600
Target5-hydroxytryptamine receptor 6(Homo sapiens (Human))
Universidad Complutense De Madrid
Curated by ChEMBL
LigandPNGBDBM50044600(CHEMBL3329446)
Affinity DataKi:  0.930nM. Assay description: Antagonist activity at human recombinant 5HT6 receptor expressed in CHO cells
In DepthDetails ArticlePubMed