BDBM50045798 CHEMBL319120::[1-[2-(2,4-Dichloro-phenyl)-ethylcarbamoyl]-2-(1H-indol-3-yl)-1-methyl-ethyl]-carbamic acid adamantan-2-yl ester
SMILES CC(Cc1c[nH]c2ccccc12)(NC(=O)OC1[C@H]2C[C@@H]3C[C@@H](C[C@H]1C3)C2)C(=O)NCCc1ccc(Cl)cc1Cl
InChI Key InChIKey=IZIFZVHACKDILP-UKZPENQXSA-N
Data  2 KI
  Tab Delimited (TSV)   2D SDfile   Computed 3D by Vconf -m prep SDfile
Find this compound or compounds like it in BindingDB:
Activity Spreadsheet -- Enzyme Inhibition Constant Data from BindingDB
Found 2 hits for monomerid = 50045798
TargetGastrin/cholecystokinin type B receptor(Homo sapiens (Human))
University Of Paris
Curated by ChEMBL
LigandPNGBDBM50045798(CHEMBL319120 | [1-[2-(2,4-Dichloro-phenyl)-ethylca...)
Affinity DataKi:  27nM. Assay description: Tested for inhibition of [3H]-pCCK-8 specific binding to cholecystokinin type B receptor in guinea pig brain cortex
In DepthDetails ArticlePubMed
TargetCholecystokinin receptor type A(Cavia porcellus)
University Of Paris
Curated by ChEMBL
LigandPNGBDBM50045798(CHEMBL319120 | [1-[2-(2,4-Dichloro-phenyl)-ethylca...)
Affinity DataKi:  3.16E+3nM. Assay description: Tested for inhibition of [3H]-pCCK-8 specific binding to cholecystokinin type A receptor in guinea pig pancreatic membranes
In DepthDetails ArticlePubMed