BDBM50045817 CHEMBL319085::{[2-(Adamantan-2-yloxycarbonylamino)-2-methyl-3-phenyl-propionyl]-phenethyl-amino}-acetic acid
SMILES CC(Cc1ccccc1)(NC(=O)OC1[C@H]2C[C@@H]3C[C@@H](C[C@H]1C3)C2)C(=O)N(CCc1ccccc1)CC(O)=O
InChI Key InChIKey=DEOUZOCNOYBARB-NEXRDHHJSA-N
Data  2 KI
  Tab Delimited (TSV)   2D SDfile   Computed 3D by Vconf -m prep SDfile
Find this compound or compounds like it in BindingDB:
Activity Spreadsheet -- Enzyme Inhibition Constant Data from BindingDB
Found 2 hits for monomerid = 50045817
TargetGastrin/cholecystokinin type B receptor(Homo sapiens (Human))
University Of Paris
Curated by ChEMBL
LigandPNGBDBM50045817(CHEMBL319085 | {[2-(Adamantan-2-yloxycarbonylamino...)
Affinity DataKi:  87nM. Assay description: Tested for inhibition of [3H]-pCCK-8 specific binding to cholecystokinin type B receptor in guinea pig brain cortex
In DepthDetails ArticlePubMed
TargetCholecystokinin receptor type A(Cavia porcellus)
University Of Paris
Curated by ChEMBL
LigandPNGBDBM50045817(CHEMBL319085 | {[2-(Adamantan-2-yloxycarbonylamino...)
Affinity DataKi:  3.80E+3nM. Assay description: Tested for inhibition of [3H]-pCCK-8 specific binding to cholecystokinin type A receptor in guinea pig pancreatic membranes
In DepthDetails ArticlePubMed