BDBM50045882 2-[5-Chloro-2-(4-chloro-phenyl)-1H-indol-3-yl]-N,N-dihexyl-acetamide::CHEMBL98572
SMILES CCCCCCN(CCCCCC)C(=O)Cc1c([nH]c2ccc(Cl)cc12)-c1ccc(Cl)cc1
InChI Key InChIKey=XTZUPNNVXIMWAR-UHFFFAOYSA-N
Data  1 KI  8 IC50
  Tab Delimited (TSV)   2D SDfile   Computed 3D by Vconf -m prep SDfile
Find this compound or compounds like it in BindingDB:
Activity Spreadsheet -- Enzyme Inhibition Constant Data from BindingDB
Found 9 hits for monomerid = 50045882
TargetTranslocator protein(Rattus norvegicus (rat))
Mayo Foundation
Curated by ChEMBL
LigandPNGBDBM50045882(2-[5-Chloro-2-(4-chloro-phenyl)-1H-indol-3-yl]-N,N...)
Affinity DataKi:  3.60nM. Assay description: Binding affinity against mitochondrial DBI complex (peripheral benzodiazepine receptor) using primary cultures of glial cells
In DepthDetails ArticlePubMed
TargetCannabinoid receptor 1(Rattus norvegicus (rat))
Mayo Foundation
Curated by ChEMBL
LigandPNGBDBM50045882(2-[5-Chloro-2-(4-chloro-phenyl)-1H-indol-3-yl]-N,N...)
Affinity DataIC50: >1.00E+3nM. Assay description: Inhibitory activity, measured by displacement [3H]-CP-55,940 from cannabinoid receptor (CB1) in rat brain
In DepthDetails ArticlePubMed
TargetGastrin/cholecystokinin type B receptor(RAT)
Mayo Foundation
Curated by ChEMBL
LigandPNGBDBM50045882(2-[5-Chloro-2-(4-chloro-phenyl)-1H-indol-3-yl]-N,N...)
Affinity DataIC50: >1.00E+3nM. Assay description: Inhibitory activity by measuring its ability to displace [3H]L-365,260 from cholecystokinin receptor in rat brain
In DepthDetails ArticlePubMed
Target5-hydroxytryptamine receptor 1A/1B/1D/1F(RAT)
Mayo Foundation
Curated by ChEMBL
LigandPNGBDBM50045882(2-[5-Chloro-2-(4-chloro-phenyl)-1H-indol-3-yl]-N,N...)
Affinity DataIC50: >1.00E+3nM. Assay description: Inhibitory activity by measuring its ability to displace [3H]ketanserin from serotonin receptor in rat brain
In DepthDetails ArticlePubMed
LigandPNGBDBM50045882(2-[5-Chloro-2-(4-chloro-phenyl)-1H-indol-3-yl]-N,N...)
Affinity DataIC50: >1.00E+3nM. Assay description: Tested for inhibitory activity by measuring its ability to displace [3H]3-PPP from opiate receptor in rat brain
In DepthDetails ArticlePubMed
TargetBeta-1/Beta-2/Beta-3 adrenergic receptor(Rattus norvegicus (Rat))
Mayo Foundation
Curated by ChEMBL
LigandPNGBDBM50045882(2-[5-Chloro-2-(4-chloro-phenyl)-1H-indol-3-yl]-N,N...)
Affinity DataIC50: >1.00E+3nM. Assay description: Inhibitory activity by measuring its ability to displace [125I]pindolol from beta-adrenergic receptor in rat brain
In DepthDetails ArticlePubMed
LigandPNGBDBM50045882(2-[5-Chloro-2-(4-chloro-phenyl)-1H-indol-3-yl]-N,N...)
Affinity DataIC50: >1.00E+3nM. Assay description: Inhibitory activity by measuring its ability to displace [3H]clonidine from alpha-adrenergic receptor in rat brain
In DepthDetails ArticlePubMed
LigandPNGBDBM50045882(2-[5-Chloro-2-(4-chloro-phenyl)-1H-indol-3-yl]-N,N...)
Affinity DataIC50: >1.00E+3nM. Assay description: Inhibition of [3H]naxolone binding to opiate receptors in rat brain
In DepthDetails ArticlePubMed
LigandPNGBDBM50045882(2-[5-Chloro-2-(4-chloro-phenyl)-1H-indol-3-yl]-N,N...)
Affinity DataIC50: >1.00E+3nM. Assay description: Inhibitory activity by measuring its ability to displace [3H]WB-4101 from alpha-adrenergic receptor in rat brain
In DepthDetails ArticlePubMed