BDBM50046186 CHEMBL3311227
SMILES O[C@@](Cn1cnnn1)(c1ccc(F)cc1F)C(F)(F)c1ccc(cn1)-c1ccc(OC(F)(F)F)cc1
InChI Key InChIKey=NCEHACHJIXJSPD-FQEVSTJZSA-N
Data  1 IC50
PDB links: 1 PDB ID matches this monomer.
  Tab Delimited (TSV)   2D SDfile   Computed 3D by Vconf -m prep SDfile
Find this compound or compounds like it in BindingDB:
Activity Spreadsheet -- Enzyme Inhibition Constant Data from BindingDB
Found 1 hit for monomerid = 50046186
TargetCytochrome P450 3A4(Homo sapiens (Human))
Viamet Pharmaceuticals
Curated by ChEMBL
LigandPNGBDBM50046186(CHEMBL3311227)
Affinity DataIC50:  7.90E+4nM. Assay description: Inhibition of CYP3A4 in human hepatocytes using testosterone as substrate by HPLC/MS/MS method
In DepthDetails ArticlePubMed