BDBM50046833 3-{4-[2-(2-tert-Butoxycarbonylamino-3-methyl-pentanoylamino)-3-methyl-pentanoylamino]-3-hydroxy-6-methyl-heptanoylamino}-propionic acid::CHEMBL145567
SMILES CCC(C)[C@H](NC(=O)OC(C)(C)C)C(=O)N[C@@H](C(C)CC)C(=O)N[C@@H](CC(C)C)C(O)CC(=O)NCCC(O)=O
InChI Key InChIKey=XVTCDIZSUXTOLE-FMUXTNLRSA-N
Data  3 IC50
  Tab Delimited (TSV)   2D SDfile   Computed 3D by Vconf -m prep SDfile
Find this compound or compounds like it in BindingDB:
Activity Spreadsheet -- Enzyme Inhibition Constant Data from BindingDB
Found 3 hits for monomerid = 50046833
TargetEndothelin-converting enzyme 1(Rattus norvegicus (Rat))
Abbott Laboratories
Curated by ChEMBL
LigandPNGBDBM50046833(3-{4-[2-(2-tert-Butoxycarbonylamino-3-methyl-penta...)
Affinity DataIC50:  58nM. Assay description: Inhibition of conversion of big endothelial-1 (Big ET-1) to ET-1 by endothelin converting enzyme(ECE) in rat lung membrane.
In DepthDetails ArticlePubMed
TargetRenin(Homo sapiens (Human))
Abbott Laboratories
Curated by ChEMBL
LigandPNGBDBM50046833(3-{4-[2-(2-tert-Butoxycarbonylamino-3-methyl-penta...)
Affinity DataIC50: >1.00E+4nMpH: 6.0Assay Description:In vitro inhibition of partially purified human renin at pH 6.0.
In DepthDetails ArticlePubMed
TargetCathepsin D(Bos taurus)
Abbott Laboratories
Curated by ChEMBL
LigandPNGBDBM50046833(3-{4-[2-(2-tert-Butoxycarbonylamino-3-methyl-penta...)
Affinity DataIC50:  190nM. Assay description: Inhibition of conversion of hemoglobin by commercially purchased bovine spleen cathepsin D.
In DepthDetails ArticlePubMed