BDBM50046861 2-(2-Amino-3-cyclohexyl-propionylamino)-3-methyl-pentanoic acid (2,3-dihydroxy-5-methyl-1-naphthalen-2-ylmethyl-hexyl)-amide; hydrochloride::CHEMBL543448
SMILES CCC(C)[C@H](NC(=O)[C@@H](N)CC1CCCCC1)C(=O)N[C@@H](Cc1ccc2ccccc2c1)[C@@H](O)[C@@H](O)CC(C)C
InChI Key InChIKey=ZQTHHPUGDXRPQI-DVRBWYGUSA-N
Data  2 IC50
  Tab Delimited (TSV)   2D SDfile   Computed 3D by Vconf -m prep SDfile
Find this compound or compounds like it in BindingDB:
Activity Spreadsheet -- Enzyme Inhibition Constant Data from BindingDB
Found 2 hits for monomerid = 50046861
TargetEndothelin-converting enzyme 1(Rattus norvegicus (Rat))
Abbott Laboratories
Curated by ChEMBL
LigandPNGBDBM50046861(2-(2-Amino-3-cyclohexyl-propionylamino)-3-methyl-p...)
Affinity DataIC50:  68nM. Assay description: Inhibition of conversion of big endothelial-1 (Big ET-1) to ET-1 by endothelin converting enzyme(ECE) in rat lung membrane.
In DepthDetails ArticlePubMed
TargetCathepsin D(Bos taurus)
Abbott Laboratories
Curated by ChEMBL
LigandPNGBDBM50046861(2-(2-Amino-3-cyclohexyl-propionylamino)-3-methyl-p...)
Affinity DataIC50:  2.50E+3nM. Assay description: Inhibition of conversion of hemoglobin by commercially purchased bovine spleen cathepsin D.
In DepthDetails ArticlePubMed