BDBM50047056 2-[1-(4-Chloro-benzyl)-5-fluoro-1H-benzoimidazol-2-ylsulfanyl]-2-methyl-propionic acid::CHEMBL274485
SMILES CC(C)(Sc1nc2cc(F)ccc2n1Cc1ccc(Cl)cc1)C(O)=O
InChI Key InChIKey=FJGHXGCLBVYFHC-UHFFFAOYSA-N
Data  1 KI
  Tab Delimited (TSV)   2D SDfile   Computed 3D by Vconf -m prep SDfile
Find this compound or compounds like it in BindingDB:
Activity Spreadsheet -- Enzyme Inhibition Constant Data from BindingDB
Found 1 hit for monomerid = 50047056
TargetThromboxane A2 receptor(Homo sapiens (Human))
Carpibem
Curated by ChEMBL
LigandPNGBDBM50047056(2-[1-(4-Chloro-benzyl)-5-fluoro-1H-benzoimidazol-2...)
Affinity DataKi:  670nM. Assay description: Tested in vitro for inhibition constant against TXA2 / PGH-2 receptor using [125I]-PTA-OH binding affinity to human platelets
In DepthDetails ArticlePubMed