BDBM50047058 4-[1-(4-Bromo-2-fluoro-benzyl)-1H-benzoimidazol-2-yl]-3,3-dimethyl-butyric acid::CHEMBL274287
SMILES CC(C)(CC(O)=O)Cc1nc2ccccc2n1Cc1ccc(Br)cc1F
InChI Key InChIKey=ONYQSHGSGFZFJF-UHFFFAOYSA-N
Data  1 KI
  Tab Delimited (TSV)   2D SDfile   Computed 3D by Vconf -m prep SDfile
Find this compound or compounds like it in BindingDB:
Activity Spreadsheet -- Enzyme Inhibition Constant Data from BindingDB
Found 1 hit for monomerid = 50047058
TargetThromboxane A2 receptor(Homo sapiens (Human))
Carpibem
Curated by ChEMBL
LigandPNGBDBM50047058(4-[1-(4-Bromo-2-fluoro-benzyl)-1H-benzoimidazol-2-...)
Affinity DataKi:  11nM. Assay description: Tested in vitro for inhibition constant against TXA2 / PGH-2 receptor using [125I]-PTA-OH binding affinity to human platelets
In DepthDetails ArticlePubMed