BDBM50047069 CHEMBL275651::{1-[1-(4-Chloro-benzyl)-5-fluoro-1H-benzoimidazol-2-ylmethyl]-cyclohexyl}-acetic acid
SMILES OC(=O)CC1(Cc2nc3cc(F)ccc3n2Cc2ccc(Cl)cc2)CCCCC1
InChI Key InChIKey=IMVYWMKEQXDBNK-UHFFFAOYSA-N
Data  1 KI
  Tab Delimited (TSV)   2D SDfile   Computed 3D by Vconf -m prep SDfile
Find this compound or compounds like it in BindingDB:
Activity Spreadsheet -- Enzyme Inhibition Constant Data from BindingDB
Found 1 hit for monomerid = 50047069
TargetThromboxane A2 receptor(Homo sapiens (Human))
Carpibem
Curated by ChEMBL
LigandPNGBDBM50047069(CHEMBL275651 | {1-[1-(4-Chloro-benzyl)-5-fluoro-1H...)
Affinity DataKi:  870nM. Assay description: Tested in vitro for inhibition constant against TXA2 / PGH-2 receptor using [125I]-PTA-OH binding affinity to human platelets
In DepthDetails ArticlePubMed