BDBM50049326 CHEMBL164563::N-{2-[Acetyl-(2-methoxy-benzyl)-amino]-1-benzyl-ethyl}-2-(4-phenyl-piperazin-1-yl)-acetamide
SMILES COc1ccccc1CN(CC(Cc1ccccc1)NC(=O)CN1CCN(CC1)c1ccccc1)C(C)=O
InChI Key InChIKey=IBWUZTJASHTQDR-UHFFFAOYSA-N
Data  1 IC50
  Tab Delimited (TSV)   2D SDfile   Computed 3D by Vconf -m prep SDfile
Find this compound or compounds like it in BindingDB:
Activity Spreadsheet -- Enzyme Inhibition Constant Data from BindingDB
Found 1 hit for monomerid = 50049326
TargetSubstance-P receptor(Homo sapiens (Human))
Eli Lilly
Curated by ChEMBL
LigandPNGBDBM50049326(CHEMBL164563 | N-{2-[Acetyl-(2-methoxy-benzyl)-ami...)
Affinity DataIC50:  8.30nM. Assay description: Inhibitory activity against Tachykinin receptor 1 in human IM-9 cells using [125I]-labeled Boltan-Hunter substance P as radioligand
In DepthDetails ArticlePubMed