BDBM50049333 CHEMBL162330::N-[1-[(Acetyl-cyclohexylmethyl-amino)-methyl]-2-(1H-indol-3-yl)-ethyl]-2-(4-phenyl-piperazin-1-yl)-acetamide
SMILES CC(=O)N(CC(Cc1c[nH]c2ccccc12)NC(=O)CN1CCN(CC1)c1ccccc1)CC1CCCCC1
InChI Key InChIKey=CEDFHOSQBBFKHX-UHFFFAOYSA-N
Data  1 IC50
  Tab Delimited (TSV)   2D SDfile   Computed 3D by Vconf -m prep SDfile
Find this compound or compounds like it in BindingDB:
Activity Spreadsheet -- Enzyme Inhibition Constant Data from BindingDB
Found 1 hit for monomerid = 50049333
TargetSubstance-P receptor(Homo sapiens (Human))
Eli Lilly
Curated by ChEMBL
LigandPNGBDBM50049333(CHEMBL162330 | N-[1-[(Acetyl-cyclohexylmethyl-amin...)
Affinity DataIC50:  21.9nM. Assay description: Inhibitory activity against Tachykinin receptor 1 in human IM-9 cells using [125I]-labeled Boltan-Hunter substance P as radioligand
In DepthDetails ArticlePubMed