BDBM50049335 CHEMBL165510::N-{2-(1H-Indol-3-yl)-1-[1-(2-methoxy-benzyl)-3-methyl-ureidomethyl]-ethyl}-2-(4-phenyl-piperazin-1-yl)-acetamide
SMILES CNC(=O)N(CC(Cc1c[nH]c2ccccc12)NC(=O)CN1CCN(CC1)c1ccccc1)Cc1ccccc1OC
InChI Key InChIKey=VAGKBJKZOUYTSH-UHFFFAOYSA-N
Data  1 IC50
  Tab Delimited (TSV)   2D SDfile   Computed 3D by Vconf -m prep SDfile
Find this compound or compounds like it in BindingDB:
Activity Spreadsheet -- Enzyme Inhibition Constant Data from BindingDB
Found 1 hit for monomerid = 50049335
TargetSubstance-P receptor(Homo sapiens (Human))
Eli Lilly
Curated by ChEMBL
LigandPNGBDBM50049335(CHEMBL165510 | N-{2-(1H-Indol-3-yl)-1-[1-(2-methox...)
Affinity DataIC50:  3nM. Assay description: Inhibitory activity against Tachykinin receptor 1 in human IM-9 cells using [125I]-labeled Boltan-Hunter substance P as radioligand
In DepthDetails ArticlePubMed