BDBM50049341 CHEMBL350381::N-{3-(1H-Indol-3-yl)-2-[2-(4-phenyl-piperazin-1-yl)-acetylamino]-propyl}-N-(2-methoxy-benzyl)-propionamide
SMILES CCC(=O)N(CC(Cc1c[nH]c2ccccc12)NC(=O)CN1CCN(CC1)c1ccccc1)Cc1ccccc1OC
InChI Key InChIKey=UCXXGXCXFDKLAY-UHFFFAOYSA-N
Data  1 IC50
  Tab Delimited (TSV)   2D SDfile   Computed 3D by Vconf -m prep SDfile
Find this compound or compounds like it in BindingDB:
Activity Spreadsheet -- Enzyme Inhibition Constant Data from BindingDB
Found 1 hit for monomerid = 50049341
TargetSubstance-P receptor(Homo sapiens (Human))
Eli Lilly
Curated by ChEMBL
LigandPNGBDBM50049341(CHEMBL350381 | N-{3-(1H-Indol-3-yl)-2-[2-(4-phenyl...)
Affinity DataIC50:  0.810nM. Assay description: Inhibitory activity against Tachykinin receptor 1 in human IM-9 cells using [125I]-labeled Boltan-Hunter substance P as radioligand
In DepthDetails ArticlePubMed