BDBM50049346 CHEMBL349882::N-[1-{[Acetyl-(2-methoxy-benzyl)-amino]-methyl}-2-(1H-indol-3-yl)-ethyl]-2-piperidin-1-yl-acetamide
SMILES COc1ccccc1CN(CC(Cc1c[nH]c2ccccc12)NC(=O)CN1CCCCC1)C(C)=O
InChI Key InChIKey=IUIUBUZQXJCBDQ-UHFFFAOYSA-N
Data  1 IC50
  Tab Delimited (TSV)   2D SDfile   Computed 3D by Vconf -m prep SDfile
Find this compound or compounds like it in BindingDB:
Activity Spreadsheet -- Enzyme Inhibition Constant Data from BindingDB
Found 1 hit for monomerid = 50049346
TargetSubstance-P receptor(Homo sapiens (Human))
Eli Lilly
Curated by ChEMBL
LigandPNGBDBM50049346(CHEMBL349882 | N-[1-{[Acetyl-(2-methoxy-benzyl)-am...)
Affinity DataIC50:  33nM. Assay description: Inhibitory activity against Tachykinin receptor 1 in human IM-9 cells using [125I]-labeled Boltan-Hunter substance P as radioligand
In DepthDetails ArticlePubMed