BDBM50049350 CHEMBL165727::[{3-(1H-Indol-3-yl)-2-[2-(4-phenyl-piperazin-1-yl)-acetylamino]-propyl}-(2-methoxy-benzyl)-amino]-acetic acid methyl ester
SMILES COC(=O)CN(CC(Cc1c[nH]c2ccccc12)NC(=O)CN1CCN(CC1)c1ccccc1)Cc1ccccc1OC
InChI Key InChIKey=GMYFUYINKONEKD-UHFFFAOYSA-N
Data  1 IC50
  Tab Delimited (TSV)   2D SDfile   Computed 3D by Vconf -m prep SDfile
Find this compound or compounds like it in BindingDB:
Activity Spreadsheet -- Enzyme Inhibition Constant Data from BindingDB
Found 1 hit for monomerid = 50049350
TargetSubstance-P receptor(Homo sapiens (Human))
Eli Lilly
Curated by ChEMBL
LigandPNGBDBM50049350(CHEMBL165727 | [{3-(1H-Indol-3-yl)-2-[2-(4-phenyl-...)
Affinity DataIC50:  31nM. Assay description: Inhibitory activity against Tachykinin receptor 1 in human IM-9 cells using [125I]-labeled Boltan-Hunter substance P as radioligand
In DepthDetails ArticlePubMed