BDBM50049354 CHEMBL163310::N-[1-{[Acetyl-(2-nitro-benzyl)-amino]-methyl}-2-(1H-indol-3-yl)-ethyl]-2-(4-phenyl-piperazin-1-yl)-acetamide
SMILES CC(=O)N(CC(Cc1c[nH]c2ccccc12)NC(=O)CN1CCN(CC1)c1ccccc1)Cc1ccccc1[N+]([O-])=O
InChI Key InChIKey=FQKOMYRVAJEDBJ-UHFFFAOYSA-N
Data  1 IC50
  Tab Delimited (TSV)   2D SDfile   Computed 3D by Vconf -m prep SDfile
Find this compound or compounds like it in BindingDB:
Activity Spreadsheet -- Enzyme Inhibition Constant Data from BindingDB
Found 1 hit for monomerid = 50049354
TargetSubstance-P receptor(Homo sapiens (Human))
Eli Lilly
Curated by ChEMBL
LigandPNGBDBM50049354(CHEMBL163310 | N-[1-{[Acetyl-(2-nitro-benzyl)-amin...)
Affinity DataIC50:  3nM. Assay description: Inhibitory activity against Tachykinin receptor 1 in human IM-9 cells using [125I]-labeled Boltan-Hunter substance P as radioligand
In DepthDetails ArticlePubMed