BDBM50049570 CHEMBL53850::Methyl-quinazolin-6-yl-amine
SMILES CNc1ccc2ncncc2c1
InChI Key InChIKey=PWGHYZCBWGVCIO-UHFFFAOYSA-N
Data  1 IC50
  Tab Delimited (TSV)   2D SDfile   Computed 3D by Vconf -m prep SDfile
Find this compound or compounds like it in BindingDB:
Activity Spreadsheet -- Enzyme Inhibition Constant Data from BindingDB
Found 1 hit for monomerid = 50049570
TargetEpidermal growth factor receptor(Homo sapiens (Human))
University of Auckland
LigandPNGBDBM50049570(CHEMBL53850 | Methyl-quinazolin-6-yl-amine)
Affinity DataIC50:  7nM. Assay description: Inhibitory potency against isolated epidermal growth factor receptor (EGFR) from human A431 carcinoma cells
In DepthDetails ArticlePubMed