BDBM50049571 CHEMBL52882::{4-[(Z)-3-Bromo-phenylimino]-3-methyl-3,4,4a,8a-tetrahydro-pyrido[4,3-d]pyrimidin-7-yl}-methyl-amine
SMILES CNC1=NC=C2C(C1)N=CN(C)C2=Nc1cccc(Br)c1
InChI Key InChIKey=PMHRKROOAOVUHG-UHFFFAOYSA-N
Data  1 IC50
  Tab Delimited (TSV)   2D SDfile   Computed 3D by Vconf -m prep SDfile
Find this compound or compounds like it in BindingDB:
Activity Spreadsheet -- Enzyme Inhibition Constant Data from BindingDB
Found 1 hit for monomerid = 50049571
TargetEpidermal growth factor receptor(Homo sapiens (Human))
University of Auckland
LigandPNGBDBM50049571(CHEMBL52882 | {4-[(Z)-3-Bromo-phenylimino]-3-methy...)
Affinity DataIC50:  3.10nM. Assay description: Inhibitory potency against isolated epidermal growth factor receptor (EGFR) from human A431 carcinoma cells
In DepthDetails ArticlePubMed