BDBM50050581 1,3-Dimethyl-6-(2-propoxy-5-thiophen-2-yl-phenyl)-1,5-dihydro-pyrazolo[3,4-d]pyrimidin-4-one::CHEMBL289344
SMILES CCCOc1ccc(cc1-c1nc2n(C)nc(C)c2c(=O)[nH]1)-c1cccs1
InChI Key InChIKey=DJDGIMIMAXMVTM-UHFFFAOYSA-N
Data  1 IC50  1 EC50
  Tab Delimited (TSV)   2D SDfile   Computed 3D by Vconf -m prep SDfile
Find this compound or compounds like it in BindingDB:
Activity Spreadsheet -- Enzyme Inhibition Constant Data from BindingDB
Found 2 hits for monomerid = 50050581
TargetcGMP-specific 3',5'-cyclic phosphodiesterase(Rattus norvegicus)
Laboratories Glaxo Wellcome Centre De Recherches
Curated by ChEMBL
LigandPNGBDBM50050581(1,3-Dimethyl-6-(2-propoxy-5-thiophen-2-yl-phenyl)-...)
Affinity DataEC50:  300nM. Assay description: Compound was tested for inhibition of stimulation of rat aortic smooth muscle cells (RSMC)
In DepthDetails ArticlePubMed
TargetcGMP-specific 3',5'-cyclic phosphodiesterase(Homo sapiens (Human))
Laboratories Glaxo Wellcome Centre De Recherches
Curated by ChEMBL
LigandPNGBDBM50050581(1,3-Dimethyl-6-(2-propoxy-5-thiophen-2-yl-phenyl)-...)
Affinity DataIC50:  5nM. Assay description: Inhibition of Phosphodiesterase 5 from human
In DepthDetails ArticlePubMed