BDBM50050619 3-Methyl-6-(2-propoxy-phenyl)-1-propyl-1,5-dihydro-pyrazolo[3,4-d]pyrimidin-4-one::CHEMBL288061
SMILES CCCOc1ccccc1-c1nc2n(CCC)nc(C)c2c(=O)[nH]1
InChI Key InChIKey=BALGSLLJFIYKHS-UHFFFAOYSA-N
Data  1 IC50  1 EC50
  Tab Delimited (TSV)   2D SDfile   Computed 3D by Vconf -m prep SDfile
Find this compound or compounds like it in BindingDB:
Activity Spreadsheet -- Enzyme Inhibition Constant Data from BindingDB
Found 2 hits for monomerid = 50050619
TargetcGMP-specific 3',5'-cyclic phosphodiesterase(Rattus norvegicus)
Laboratories Glaxo Wellcome Centre De Recherches
Curated by ChEMBL
LigandPNGBDBM50050619(3-Methyl-6-(2-propoxy-phenyl)-1-propyl-1,5-dihydro...)
Affinity DataEC50:  150nM. Assay description: Compound was tested for inhibition of stimulation of rat aortic smooth muscle cells (RSMC)
In DepthDetails ArticlePubMed
TargetcGMP-specific 3',5'-cyclic phosphodiesterase(Homo sapiens (Human))
Laboratories Glaxo Wellcome Centre De Recherches
Curated by ChEMBL
LigandPNGBDBM50050619(3-Methyl-6-(2-propoxy-phenyl)-1-propyl-1,5-dihydro...)
Affinity DataIC50:  1nM. Assay description: Inhibition of Phosphodiesterase 5 from human
In DepthDetails ArticlePubMed