BDBM50051663 2-(4-Chloro-phenyl)-5,6-dimethyl-7-((R)-1-phenyl-ethyl)-3,7-dihydro-pyrrolo[2,3-d]pyrimidin-4-one::CHEMBL84368
SMILES C[C@H](c1ccccc1)n1c(C)c(C)c2c1nc([nH]c2=O)-c1ccc(Cl)cc1
InChI Key InChIKey=DYWXNZMNTJKRLH-OAHLLOKOSA-N
Data  2 KI
  Tab Delimited (TSV)   2D SDfile   Computed 3D by Vconf -m prep SDfile
Find this compound or compounds like it in BindingDB:
Activity Spreadsheet -- Enzyme Inhibition Constant Data from BindingDB
Found 2 hits for monomerid = 50051663
TargetAdenosine receptor A2a(Rattus norvegicus (rat))
Julius-Maximilians-UniversitäT WüRzburg
Curated by ChEMBL
LigandPNGBDBM50051663(2-(4-Chloro-phenyl)-5,6-dimethyl-7-((R)-1-phenyl-e...)
Affinity DataKi: >3.00E+4nM. Assay description: Radioligand binding assay for [3H]-NECA affinity towards adenosine A2A receptor of rat striatum
In DepthDetails ArticlePubMed
TargetAdenosine receptor A1(Rattus norvegicus (rat))
Julius-Maximilians-UniversitäT WüRzburg
Curated by ChEMBL
LigandPNGBDBM50051663(2-(4-Chloro-phenyl)-5,6-dimethyl-7-((R)-1-phenyl-e...)
Affinity DataKi: >3.00E+4nM. Assay description: Radioligand binding assay for [3H]-PIA affinity towards Adenosine A1 receptor of rat cerebral cortical membrane
In DepthDetails ArticlePubMed