BDBM50051899 1-Benzyl-4-{4-[2-(4,5-diphenyl-1H-imidazol-2-yl)-5-methyl-[1,3]dioxan-5-yl]-butyl}-piperazine::CHEMBL286836
SMILES CC1(CCCCN2CCN(Cc3ccccc3)CC2)COC(OC1)c1nc(c([nH]1)-c1ccccc1)-c1ccccc1
InChI Key InChIKey=BTVAXISHIKIWBV-UHFFFAOYSA-N
Data  1 IC50
  Tab Delimited (TSV)   2D SDfile   Computed 3D by Vconf -m prep SDfile
Find this compound or compounds like it in BindingDB:
Activity Spreadsheet -- Enzyme Inhibition Constant Data from BindingDB
Found 1 hit for monomerid = 50051899
TargetSterol O-acyltransferase 1(Homo sapiens (Human))
RhôNe-Poulenc Rorer
Curated by ChEMBL
LigandPNGBDBM50051899(1-Benzyl-4-{4-[2-(4,5-diphenyl-1H-imidazol-2-yl)-5...)
Affinity DataIC50:  90nM. Assay description: Inhibitory concentration of the compound was evaluated as concentration required to inhibit 50% of the activity of human Acyl coenzyme A:cholesterol ...
In DepthDetails ArticlePubMed