BDBM50051902 4,5-Diphenyl-2-(tetrahydro-pyran-2-yl)-1H-imidazole::CHEMBL33288
SMILES C1CCC(OC1)c1nc(c([nH]1)-c1ccccc1)-c1ccccc1
InChI Key InChIKey=PQUPCWQOHLQDSH-UHFFFAOYSA-N
Data  2 IC50
  Tab Delimited (TSV)   2D SDfile   Computed 3D by Vconf -m prep SDfile
Find this compound or compounds like it in BindingDB:
Activity Spreadsheet -- Enzyme Inhibition Constant Data from BindingDB
Found 2 hits for monomerid = 50051902
TargetSterol O-acyltransferase 1(Rattus norvegicus)TBA
LigandPNGBDBM50051902(4,5-Diphenyl-2-(tetrahydro-pyran-2-yl)-1H-imidazol...)
Affinity DataIC50:  110nM. Assay description: Inhibition of ACAT in rat
In DepthDetails PubMed
TargetSterol O-acyltransferase 1(Rattus norvegicus)TBA
LigandPNGBDBM50051902(4,5-Diphenyl-2-(tetrahydro-pyran-2-yl)-1H-imidazol...)
Affinity DataIC50:  110nM. Assay description: In vitro inhibition of Acyl coenzyme A:cholesterol acyltransferase 1 from rat liver.
In DepthDetails ArticlePubMed