BDBM50051907 1-{4-[2-(4,5-Diphenyl-1H-imidazol-2-yl)-5-methyl-[1,3]dioxan-5-yl]-butyl}-1H-indazole::CHEMBL286583
SMILES CC1(CCCCn2ncc3ccccc23)COC(OC1)c1nc(c([nH]1)-c1ccccc1)-c1ccccc1
InChI Key InChIKey=HZEGFDPXZGXAJK-UHFFFAOYSA-N
Data  1 IC50
  Tab Delimited (TSV)   2D SDfile   Computed 3D by Vconf -m prep SDfile
Find this compound or compounds like it in BindingDB:
Activity Spreadsheet -- Enzyme Inhibition Constant Data from BindingDB
Found 1 hit for monomerid = 50051907
TargetSterol O-acyltransferase 1(Homo sapiens (Human))
RhôNe-Poulenc Rorer
Curated by ChEMBL
LigandPNGBDBM50051907(1-{4-[2-(4,5-Diphenyl-1H-imidazol-2-yl)-5-methyl-[...)
Affinity DataIC50:  130nM. Assay description: Inhibitory concentration of the compound was evaluated as concentration required to inhibit 50% of the Acyl coenzyme A:cholesterol acyltransferase 1 ...
In DepthDetails ArticlePubMed