BDBM50052003 CHEMBL38355::[10-(3,5-Bis-trifluoromethyl-phenyl)-2,4-dioxo-4,10-dihydro-2H-benzo[g]pteridin-3-yl]-acetic acid ethyl ester
SMILES CCOC(=O)Cn1c(=O)nc2n(-c3cc(cc(c3)C(F)(F)F)C(F)(F)F)c3ccccc3nc2c1=O
InChI Key InChIKey=AEPBBLXFTYMALN-UHFFFAOYSA-N
Data  1 IC50
  Tab Delimited (TSV)   2D SDfile   Computed 3D by Vconf -m prep SDfile
Find this compound or compounds like it in BindingDB:
Activity Spreadsheet -- Enzyme Inhibition Constant Data from BindingDB
Found 1 hit for monomerid = 50052003
TargetGlutathione reductase, mitochondrial(Homo sapiens (Human))
Institut FüR Biochemie Ii Der UniversitäT
Curated by ChEMBL
LigandPNGBDBM50052003(CHEMBL38355 | [10-(3,5-Bis-trifluoromethyl-phenyl)...)
Affinity DataIC50:  1.00E+5nM. Assay description: Inhibitory activity against human glutathione reductase in presence of 100 microM GSSG
In DepthDetails ArticlePubMed