BDBM50053527 4-{3-[7-(3-Methyl-1H-tetrazol-5-yl)-5-phenyl-naphthalen-2-yloxymethyl]-phenyl}-tetrahydro-pyran-4-ol::CHEMBL129167
SMILES Cn1nnc(n1)-c1cc(-c2ccccc2)c2ccc(OCc3cccc(c3)C3(O)CCOCC3)cc2c1
InChI Key InChIKey=KPTDWDBVGMZQMP-UHFFFAOYSA-N
Data  1 IC50
  Tab Delimited (TSV)   2D SDfile   Computed 3D by Vconf -m prep SDfile
Find this compound or compounds like it in BindingDB:
Activity Spreadsheet -- Enzyme Inhibition Constant Data from BindingDB
Found 1 hit for monomerid = 50053527
TargetPolyunsaturated fatty acid 5-lipoxygenase(Homo sapiens (Human))
Merck Frosst Centre For Therapeutic Research
Curated by ChEMBL
LigandPNGBDBM50053527(4-{3-[7-(3-Methyl-1H-tetrazol-5-yl)-5-phenyl-napht...)
Affinity DataIC50:  120nM. Assay description: Potency to inhibit oxidation of arachidonic acid by recombinant human 5-lipoxygenase
In DepthDetails ArticlePubMed