BDBM50054413 CHEMBL3319395
SMILES COc1ccc(cc1OC)-c1c[nH]c2ncc(cc12)-c1cccc(C)c1
InChI Key InChIKey=HNGSJXZYXQEDOC-UHFFFAOYSA-N
Data  2 IC50
  Tab Delimited (TSV)   2D SDfile   Computed 3D by Vconf -m prep SDfile
Find this compound or compounds like it in BindingDB:
Activity Spreadsheet -- Enzyme Inhibition Constant Data from BindingDB
Found 2 hits for monomerid = 50054413
TargetMast/stem cell growth factor receptor Kit(Homo sapiens (Human))
Korea Advanced Institute Of Science And Technology (Kaist)
Curated by ChEMBL
LigandPNGBDBM50054413(CHEMBL3319395)
Affinity DataIC50:  261nM. Assay description: Inhibition of wild type c-KIT (unknown origin)
In DepthDetails ArticlePubMed
TargetPhosphatidylinositol 4,5-bisphosphate 3-kinase catalytic subunit alpha isoform(Homo sapiens (Human))
Korea Advanced Institute Of Science And Technology (Kaist)
Curated by ChEMBL
LigandPNGBDBM50054413(CHEMBL3319395)
Affinity DataIC50: >1.00E+4nM. Assay description: Inhibition of PI3Kalpha (unknown origin)
In DepthDetails ArticlePubMed