BDBM50054415 CHEMBL2152263
SMILES COc1ccc(cc1OC)-c1c[nH]c2ncc(cc12)-c1cccc(c1)C#N
InChI Key InChIKey=DZBBOKXUSCCELR-UHFFFAOYSA-N
Data  3 IC50
  Tab Delimited (TSV)   2D SDfile   Computed 3D by Vconf -m prep SDfile
Find this compound or compounds like it in BindingDB:
Activity Spreadsheet -- Enzyme Inhibition Constant Data from BindingDB
Found 3 hits for monomerid = 50054415
TargetPhosphatidylinositol 4,5-bisphosphate 3-kinase catalytic subunit alpha isoform(Homo sapiens (Human))
Korea Advanced Institute Of Science And Technology (Kaist)
Curated by ChEMBL
LigandPNGBDBM50054415(CHEMBL2152263)
Affinity DataIC50: >1.00E+4nM. Assay description: Inhibition of c-KIT D816V mutant (unknown origin)
In DepthDetails ArticlePubMed
TargetMast/stem cell growth factor receptor Kit(Homo sapiens (Human))
Korea Advanced Institute Of Science And Technology (Kaist)
Curated by ChEMBL
LigandPNGBDBM50054415(CHEMBL2152263)
Affinity DataIC50: >1.00E+4nM. Assay description: Inhibition of c-KIT D816V mutant (unknown origin)
In DepthDetails ArticlePubMed
TargetMast/stem cell growth factor receptor Kit(Homo sapiens (Human))
Korea Advanced Institute Of Science And Technology (Kaist)
Curated by ChEMBL
LigandPNGBDBM50054415(CHEMBL2152263)
Affinity DataIC50:  64nM. Assay description: Inhibition of wild type c-KIT (unknown origin)
In DepthDetails ArticlePubMed