BDBM50054424 CHEMBL3319471
SMILES COc1ccc(cc1OC)-c1c[nH]c2ncc(cc12)-c1ccc2OCOc2c1
InChI Key InChIKey=KXMHQLRHICRNTD-UHFFFAOYSA-N
Data  2 IC50
  Tab Delimited (TSV)   2D SDfile   Computed 3D by Vconf -m prep SDfile
Find this compound or compounds like it in BindingDB:
Activity Spreadsheet -- Enzyme Inhibition Constant Data from BindingDB
Found 2 hits for monomerid = 50054424
TargetMast/stem cell growth factor receptor Kit(Homo sapiens (Human))
Korea Advanced Institute Of Science And Technology (Kaist)
Curated by ChEMBL
LigandPNGBDBM50054424(CHEMBL3319471)
Affinity DataIC50:  49nM. Assay description: Inhibition of c-KIT D816V mutant (unknown origin)
In DepthDetails ArticlePubMed
TargetMast/stem cell growth factor receptor Kit(Homo sapiens (Human))
Korea Advanced Institute Of Science And Technology (Kaist)
Curated by ChEMBL
LigandPNGBDBM50054424(CHEMBL3319471)
Affinity DataIC50:  1.08E+4nM. Assay description: Inhibition of wild type c-KIT (unknown origin)
In DepthDetails ArticlePubMed