BDBM50054441 CHEMBL3319470
SMILES COc1ccc(cc1N)-c1cnc2[nH]cc(-c3ccc(OC)c(OC)c3)c2c1
InChI Key InChIKey=MHEGEHOQTHDPJD-UHFFFAOYSA-N
Data  2 IC50
  Tab Delimited (TSV)   2D SDfile   Computed 3D by Vconf -m prep SDfile
Find this compound or compounds like it in BindingDB:
Activity Spreadsheet -- Enzyme Inhibition Constant Data from BindingDB
Found 2 hits for monomerid = 50054441
TargetMast/stem cell growth factor receptor Kit(Homo sapiens (Human))
Korea Advanced Institute Of Science And Technology (Kaist)
Curated by ChEMBL
LigandPNGBDBM50054441(CHEMBL3319470)
Affinity DataIC50:  26nM. Assay description: Inhibition of c-KIT D816V mutant (unknown origin)
In DepthDetails ArticlePubMed
TargetMast/stem cell growth factor receptor Kit(Homo sapiens (Human))
Korea Advanced Institute Of Science And Technology (Kaist)
Curated by ChEMBL
LigandPNGBDBM50054441(CHEMBL3319470)
Affinity DataIC50: >1.00E+4nM. Assay description: Inhibition of wild type c-KIT (unknown origin)
In DepthDetails ArticlePubMed