BDBM50054446 CHEMBL3319465
SMILES Nc1cccc(c1)-c1cnc2[nH]cc(-c3ccc(Cl)cc3)c2c1
InChI Key InChIKey=LPGPVNDSMJSOJF-UHFFFAOYSA-N
Data  1 IC50
  Tab Delimited (TSV)   2D SDfile   Computed 3D by Vconf -m prep SDfile
Find this compound or compounds like it in BindingDB:
Activity Spreadsheet -- Enzyme Inhibition Constant Data from BindingDB
Found 1 hit for monomerid = 50054446
TargetMast/stem cell growth factor receptor Kit(Homo sapiens (Human))
Korea Advanced Institute Of Science And Technology (Kaist)
Curated by ChEMBL
LigandPNGBDBM50054446(CHEMBL3319465)
Affinity DataIC50:  2.26E+3nM. Assay description: Inhibition of c-KIT D816V mutant (unknown origin)
In DepthDetails ArticlePubMed