BDBM50054453 CHEMBL3319459
SMILES Nc1cccc(c1)-c1cnc2[nH]cc(-c3ccccc3N)c2c1
InChI Key InChIKey=APRFPNOEGHQIFN-UHFFFAOYSA-N
Data  1 IC50
  Tab Delimited (TSV)   2D SDfile   Computed 3D by Vconf -m prep SDfile
Find this compound or compounds like it in BindingDB:
Activity Spreadsheet -- Enzyme Inhibition Constant Data from BindingDB
Found 1 hit for monomerid = 50054453
TargetMast/stem cell growth factor receptor Kit(Homo sapiens (Human))
Korea Advanced Institute Of Science And Technology (Kaist)
Curated by ChEMBL
LigandPNGBDBM50054453(CHEMBL3319459)
Affinity DataIC50:  1.42E+3nM. Assay description: Inhibition of c-KIT D816V mutant (unknown origin)
In DepthDetails ArticlePubMed