BDBM50054454 CHEMBL3319458
SMILES COc1ccc(cc1F)-c1c[nH]c2ncc(cc12)-c1cccc(N)c1
InChI Key InChIKey=OHIGVAWQEDVKEJ-UHFFFAOYSA-N
Data  1 IC50
  Tab Delimited (TSV)   2D SDfile   Computed 3D by Vconf -m prep SDfile
Find this compound or compounds like it in BindingDB:
Activity Spreadsheet -- Enzyme Inhibition Constant Data from BindingDB
Found 1 hit for monomerid = 50054454
TargetMast/stem cell growth factor receptor Kit(Homo sapiens (Human))
Korea Advanced Institute Of Science And Technology (Kaist)
Curated by ChEMBL
LigandPNGBDBM50054454(CHEMBL3319458)
Affinity DataIC50:  104nM. Assay description: Inhibition of c-KIT D816V mutant (unknown origin)
In DepthDetails ArticlePubMed