BDBM50054466 (5Z,8Z,11Z,14Z)-Icosa-5,8,11,14-tetraenoic acid (2-hydroxy-butyl)-amide::CHEMBL343975
SMILES CCCCC\C=C/C\C=C/C\C=C/C\C=C/CCCC(=O)NCC(O)CC
InChI Key InChIKey=MACULBULRUTWAT-GKFVBPDJSA-N
Data  1 KI
  Tab Delimited (TSV)   2D SDfile   Computed 3D by Vconf -m prep SDfile
Find this compound or compounds like it in BindingDB:
Activity Spreadsheet -- Enzyme Inhibition Constant Data from BindingDB
Found 1 hit for monomerid = 50054466
TargetCannabinoid receptor 1(Rattus norvegicus (rat))
University Of Connecticut
Curated by ChEMBL
LigandPNGBDBM50054466((5Z,8Z,11Z,14Z)-Icosa-5,8,11,14-tetraenoic acid (2...)
Affinity DataKi:  203nM. Assay description: Displacement of [3H]-CP-55,940 from Cannabinoid receptor 1 of rat forebrain membranes
In DepthDetails ArticlePubMed