BDBM50055056 CHEMBL3319475
SMILES COc1ccc(cc1OC)-c1c[nH]c2ncc(cc12)-c1ccc(OCCN2CCOCC2)c(N)c1
InChI Key InChIKey=MHVCXKBHHRUDTF-UHFFFAOYSA-N
Data  2 IC50
  Tab Delimited (TSV)   2D SDfile   Computed 3D by Vconf -m prep SDfile
Find this compound or compounds like it in BindingDB:
Activity Spreadsheet -- Enzyme Inhibition Constant Data from BindingDB
Found 2 hits for monomerid = 50055056
TargetMast/stem cell growth factor receptor Kit(Homo sapiens (Human))
Korea Advanced Institute Of Science And Technology (Kaist)
Curated by ChEMBL
LigandPNGBDBM50055056(CHEMBL3319475)
Affinity DataIC50:  14nM. Assay description: Inhibition of c-KIT D816V mutant (unknown origin)
In DepthDetails ArticlePubMed
TargetMast/stem cell growth factor receptor Kit(Homo sapiens (Human))
Korea Advanced Institute Of Science And Technology (Kaist)
Curated by ChEMBL
LigandPNGBDBM50055056(CHEMBL3319475)
Affinity DataIC50:  8.54E+3nM. Assay description: Inhibition of wild type c-KIT (unknown origin)
In DepthDetails ArticlePubMed