BDBM50055199 (3-Acetoxy-phenyl)-trimethyl-ammonium::CHEMBL343344
SMILES CC(=O)Oc1cccc(c1)[N+](C)(C)C
InChI Key InChIKey=OEUQDGNNEYCCQW-UHFFFAOYSA-N
Data  2 IC50
  Tab Delimited (TSV)   2D SDfile   Computed 3D by Vconf -m prep SDfile
Find this compound or compounds like it in BindingDB:
Activity Spreadsheet -- Enzyme Inhibition Constant Data from BindingDB
Found 2 hits for monomerid = 50055199
TargetAcetylcholinesterase(Homo sapiens (Human))
Harvard University
Curated by ChEMBL
LigandPNGBDBM50055199((3-Acetoxy-phenyl)-trimethyl-ammonium | CHEMBL3433...)
Affinity DataIC50:  3.01E+3nM. Assay description: Inhibition acetylcholinesterase (AChE) enzyme.
In DepthDetails ArticlePubMed
TargetAcetylcholinesterase(Electrophorus electricus (Electric eel))
University Of North Carolina
Curated by ChEMBL
LigandPNGBDBM50055199((3-Acetoxy-phenyl)-trimethyl-ammonium | CHEMBL3433...)
Affinity DataIC50:  3.01E+3nM. Assay description: Inhibitory activity against Acetylcholinesterase
In DepthDetails ArticlePubMed